Jump to content

bodek23

Użytkownicy
  • Content Count

    331
  • Joined

  • Last visited

  • Days Won

    15

bodek23 last won the day on July 8

bodek23 had the most liked content!

Community Reputation

66 Bardzo Dobra

About bodek23

  • Rank
    Czynny

Contact Methods

  • Website URL
    http://
  • ICQ
    6575926

Profile Information

  • Płeć
    Mężczyzna

Recent Profile Visitors

1,192 profile views
  1. fe-mmp.ko do nieusunięcia , problem z głowicą DVB-S2 player2.ko brak obrazu
  2. zrobiłem to ltsubuntu.sh i nic z tego coś jest nie tak z gitem problem z python3-native-3.7.3-r0 error , openvision-development-platform openvision-enigma2-develop-7.0-rx File "/home/detyr/Pulpit/openpli-oe-core/bitbake/lib/bb/data_smart.py", line 426, in DataSmart.expandWithRefs(s='${@bb.fetch2.get_srcrev(d)}', varname='SRCPV'): except Exception as exc: > raise ExpansionError(varname, s, exc) from exc bb.data_smart.ExpansionError: Failure expanding variable SRCPV, expression was ${@bb.fetch2.get_srcrev(d)} which triggered exception FetchError: Fetcher failure: Fetch command export DBUS_SESSION_BUS_ADDRESS="unix:path=/run/user/1000/bus"; export SSH_AGENT_PID="1116"; export SSH_AUTH_SOCK="/run/user/1000/keyring/ssh"; export PATH="/home/detyr/Pulpit/openpli-oe-core/openembedded-core/scripts:/home/detyr/Pulpit/openpli-oe-core/build/tmp/work/all-oe-linux/enigma2-plugin-systemplugins-bh-skin-support/fetcheravoidrecurse-r0/recipe-sysroot-native/usr/bin/sh4-oe-linux:/home/detyr/Pulpit/openpli-oe-core/build/tmp/work/all-oe-linux/enigma2-plugin-systemplugins-bh-skin-support/fetcheravoidrecurse-r0/recipe-sysroot/usr/bin/crossscripts:/home/detyr/Pulpit/openpli-oe-core/build/tmp/work/all-oe-linux/enigma2-plugin-systemplugins-bh-skin-support/fetcheravoidrecurse-r0/recipe-sysroot-native/usr/sbin:/home/detyr/Pulpit/openpli-oe-core/build/tmp/work/all-oe-linux/enigma2-plugin-systemplugins-bh-skin-support/fetcheravoidrecurse-r0/recipe-sysroot-native/usr/bin:/home/detyr/Pulpit/openpli-oe-core/build/tmp/work/all-oe-linux/enigma2-plugin-systemplugins-bh-skin-support/fetcheravoidrecurse-r0/recipe-sysroot-native/sbin:/home/detyr/Pulpit/openpli-oe-core/build/tmp/work/all-oe-linux/enigma2-plugin-systemplugins-bh-skin-support/fetcheravoidrecurse-r0/recipe-sysroot-native/bin:/home/detyr/Pulpit/openpli-oe-core/bitbake/bin:/home/detyr/Pulpit/openpli-oe-core/build/tmp/hosttools"; export HOME="/home/detyr"; git -c core.fsyncobjectfiles=0 ls-remote git://github.com/OpenVisionE2/enigma2-plugin-systemplugins-bh-skin-support.git failed with exit code 128, output: fatal: remote error: Repository not found. Summary: There was 1 ERROR message shown, returning a non-zero exit code. Makefile:126: recipe for target 'image' failed make: *** [image] Error 1 Building image for ufs910 ERROR: ExpansionError during parsing /home/detyr/Pulpit/openpli-oe-core/openvision-oe/recipes-openvision/enigma2-plugins/enigma2-plugin-systemplugins-bh-skin-support.bb Traceback (most recent call last): File "/home/detyr/Pulpit/openpli-oe-core/bitbake/lib/bb/data_smart.py", line 412, in DataSmart.expandWithRefs(s='1.0+git${SRCPV}', varname='PV'): try: > s = __expand_var_regexp__.sub(varparse.var_sub, s) try: File "/home/detyr/Pulpit/openpli-oe-core/bitbake/lib/bb/data_smart.py", line 111, in VariableParse.var_sub(match=<_sre.SRE_Match object; span=(7, 15), match='${SRCPV}'>): else: > var = self.d.getVarFlag(key, "_content") self.references.add(key) File "/home/detyr/Pulpit/openpli-oe-core/bitbake/lib/bb/data_smart.py", line 794, in DataSmart.getVarFlag(var='SRCPV', flag='_content', expand=True, noweakdefault=False, parsing=False): cachename = var + "[" + flag + "]" > value = self.expand(value, cachename) File "/home/detyr/Pulpit/openpli-oe-core/bitbake/lib/bb/data_smart.py", line 436, in DataSmart.expand(s='${@bb.fetch2.get_srcrev(d)}', varname='SRCPV'): def expand(self, s, varname = None): > return self.expandWithRefs(s, varname).value File "/home/detyr/Pulpit/openpli-oe-core/bitbake/lib/bb/data_smart.py", line 426, in DataSmart.expandWithRefs(s='${@bb.fetch2.get_srcrev(d)}', varname='SRCPV'): except Exception as exc: > raise ExpansionError(varname, s, exc) from exc bb.data_smart.ExpansionError: Failure expanding variable SRCPV, expression was ${@bb.fetch2.get_srcrev(d)} which triggered exception FetchError: Fetcher failure: Fetch command export DBUS_SESSION_BUS_ADDRESS="unix:path=/run/user/1000/bus"; export SSH_AGENT_PID="1116"; export SSH_AUTH_SOCK="/run/user/1000/keyring/ssh"; export PATH="/home/detyr/Pulpit/openpli-oe-core/openembedded-core/scripts:/home/detyr/Pulpit/openpli-oe-core/build/tmp/work/all-oe-linux/enigma2-plugin-systemplugins-bh-skin-support/fetcheravoidrecurse-r0/recipe-sysroot-native/usr/bin/sh4-oe-linux:/home/detyr/Pulpit/openpli-oe-core/build/tmp/work/all-oe-linux/enigma2-plugin-systemplugins-bh-skin-support/fetcheravoidrecurse-r0/recipe-sysroot/usr/bin/crossscripts:/home/detyr/Pulpit/openpli-oe-core/build/tmp/work/all-oe-linux/enigma2-plugin-systemplugins-bh-skin-support/fetcheravoidrecurse-r0/recipe-sysroot-native/usr/sbin:/home/detyr/Pulpit/openpli-oe-core/build/tmp/work/all-oe-linux/enigma2-plugin-systemplugins-bh-skin-support/fetcheravoidrecurse-r0/recipe-sysroot-native/usr/bin:/home/detyr/Pulpit/openpli-oe-core/build/tmp/work/all-oe-linux/enigma2-plugin-systemplugins-bh-skin-support/fetcheravoidrecurse-r0/recipe-sysroot-native/sbin:/home/detyr/Pulpit/openpli-oe-core/build/tmp/work/all-oe-linux/enigma2-plugin-systemplugins-bh-skin-support/fetcheravoidrecurse-r0/recipe-sysroot-native/bin:/home/detyr/Pulpit/openpli-oe-core/bitbake/bin:/home/detyr/Pulpit/openpli-oe-core/build/tmp/hosttools"; export HOME="/home/detyr"; git -c core.fsyncobjectfiles=0 ls-remote git://github.com/OpenVisionE2/enigma2-plugin-systemplugins-bh-skin-support.git failed with exit code 128, output: fatal: remote error: Repository not found. Summary: There was 1 ERROR message shown, returning a non-zero exit code. Makefile:126: recipe for target 'image' failed make: *** [image] Error 1 Done, the compiled image is in build/tmp/deploy/images/ folder! It's a zipped file like openvision-enigma2-develop-7.0-rx-.zip detyr@detyr-System-Product-Name:~/Pulpit/openpli-oe-core/openvision-oe$
  3. jak mam kompilować jak git ma babole znów cudują dodają funkcje do niczego nie potrzebne , chyba po to by wnerwiać testerów
  4. @ sid8796 compilation nbox python3-native-3.7.3-r0 error NOTE: recipe python3-native-3.7.3-r0: task do_prepare_recipe_sysroot: Started NOTE: recipe python3-native-3.7.3-r0: task do_prepare_recipe_sysroot: Succeeded NOTE: Running task 576 of 6146 (virtual:native:/home/detyr/Pulpit/openvision-development-platform/openembedded-core/meta/recipes-devtools/python/python3_3.7.3.bb:do_configure) NOTE: recipe python3-native-3.7.3-r0: task do_configure: Started NOTE: recipe elfutils-native-0.176-r0: task do_compile: Succeeded NOTE: Running task 577 of 6146 (virtual:native:/home/detyr/Pulpit/openvision-development-platform/openembedded-core/meta/recipes-devtools/elfutils/elfutils_0.176.bb:do_install) NOTE: recipe elfutils-native-0.176-r0: task do_install: Started NOTE: recipe elfutils-native-0.176-r0: task do_install: Succeeded NOTE: Running task 578 of 6146 (virtual:native:/home/detyr/Pulpit/openvision-development-platform/openembedded-core/meta/recipes-devtools/elfutils/elfutils_0.176.bb:do_populate_sysroot) NOTE: recipe elfutils-native-0.176-r0: task do_populate_sysroot: Started NOTE: recipe elfutils-native-0.176-r0: task do_populate_sysroot: Succeeded NOTE: Running task 579 of 6146 (virtual:native:/home/detyr/Pulpit/openvision-development-platform/openembedded-core/meta/recipes-devtools/elfutils/elfutils_0.176.bb:do_rm_work) NOTE: recipe elfutils-native-0.176-r0: task do_rm_work: Started NOTE: recipe elfutils-native-0.176-r0: task do_rm_work: Succeeded NOTE: Running noexec task 580 of 6146 (virtual:native:/home/detyr/Pulpit/openvision-development-platform/openembedded-core/meta/recipes-devtools/elfutils/elfutils_0.176.bb:do_build) NOTE: Running noexec task 581 of 6146 (virtual:native:/home/detyr/Pulpit/openvision-development-platform/openembedded-core/meta/recipes-devtools/dwarfsrcfiles/dwarfsrcfiles.bb:do_rm_work_all) NOTE: Running task 582 of 6146 (virtual:native:/home/detyr/Pulpit/openvision-development-platform/openembedded-core/meta/recipes-devtools/file/file_5.37.bb:do_fetch) NOTE: recipe file-native-5.37-r0: task do_fetch: Started ERROR: python3-native-3.7.3-r0 do_configure: configure failed ERROR: python3-native-3.7.3-r0 do_configure: Function failed: do_configure (log file is located at /home/detyr/Pulpit/openvision-development-platform/build/tmp/work/i686-linux/python3-native/3.7.3-r0/temp/log.do_configure.13185) ERROR: Logfile of failure stored in: /home/detyr/Pulpit/openvision-development-platform/build/tmp/work/i686-linux/python3-native/3.7.3-r0/temp/log.do_configure.13185 NOTE: recipe python3-native-3.7.3-r0: task do_configure: Failed ERROR: Task (virtual:native:/home/detyr/Pulpit/openvision-development-platform/openembedded-core/meta/recipes-devtools/python/python3_3.7.3.bb:do_configure) failed with exit code '1' NOTE: Running task 583 of 6146 (virtual:native:/home/detyr/Pulpit/openvision-development-platform/openembedded-core/meta/recipes-devtools/e2fsprogs/e2fsprogs_1.44.5.bb:do_fetch) NOTE: recipe e2fsprogs-native-
  5. Tak stop i nie powrócę miałem nieszczęśliwy wypadek , zdrowie nie pozwala na dalsze prace z tym związane
  6. nie troluj od kiedy ja niby jestem twórcą - openvision-enigma , i nie jestem członkiem tej grupy jak już coś piszesz to czytaj z dokładnie a nie po łepkach , cytat : i nie wciskam nikomu czegos co nie dziala.. - nikt nikogo nie zmusza ,wiec daruj już z tym bełkotem w tym temacie edit admin: @bodek23 przypominam jeszcze raz regulamin ...
  7. słuchaj geniusz twoja wypowiedz to świadczy o tym że twój umysł kupy ni dupy się trzyma , jak ci nie pasuje to stwórz sam , a nie smędz farmazony
  8. sprawdzę co tam dolega jak nie dziś to jutro dam znać
  9. jak będę miał czas to może coś wyskrobie pod ADB 2849ST , 2850 teraz pace7241 , sagemcom88 idzie
  10. nawiązując do wifi , co miał problem kolega @ bodziohk zrobiłem mała modyfikacje w modutils.sh ale są problemy log. Start networking /etc/init.d/rc: /etc/rcS.d/S05modutils.sh: line 1: /ect/config/wlan.conf: not found sh: off: unknown operand sh: rt3070: unknown operand sh: rt5370: unknown operand zram: num_devices not specified. Using default: 1 zram: Creating 1 devices ... Start networking /etc/init.d/rc: /etc/rcS.d/S05modutils.sh: line 1: /ect/config/wlan.conf: not found sh: off: unknown operand sh: rt3070: unknown operand sh: rt5370: unknown operand Start networking /etc/init.d/rc: /etc/rcS.d/S05modutils.sh: line 1: /ect/config/wlan.conf: not found sh: off: unknown operand sh: rt3070: unknown operand sh: rt5370: unknown operand modutils.sh echo "Start networking" if [ -e /etc/network/interfaces ]; then /ect/config/wlan.conf if [ $wlan == off ]; then /etc/init.d/networking restart & elif [ $wlan == rt3070 ]; then modprobe rt3070sta ifconfig ra0 up echo "rt3070 driver loaded" /etc/init.d/networking restart & elif [ $wlan == rt5370 ]; then modprobe rt5370sta ifconfig ra0 up echo "rt5370 driver loaded" /etc/init.d/networking restart & fi fi [ "$module" == "zram" ] && echo "16777216" > /sys/block/zram0/disksize # Use 16Mb for swap in ram done } zapomniałem że sid8796 dodał do nowej kompilacji wireless teraz niech wypowie się @bodziohk czy działa wifi
  11. skin z PIG działa też prawidłowo od vers ,2019-02-08_openvision-enigma2-develop-7.0-r6-adb_box mojego testu i nic dziwnego że komuś nie działa na szrocie
  12. idzie już spać dawno po dobranoce player2.ko dział już ok z kompilacji openvision-enigma2-develop-7.1-r10-adb_box i nie zawracać głowy @sid8796 pierdołami dzięki @sid8796 za wprowadzone zmiany
  13. po jaką cho.... ma robic dodatkowy katalog skoro z tmp po resecie znika wszystko przykład : cd /tmp mkdir 1 mkdir 2 mkdir 3 Montujemy przykładowe sdb mount /dev/sda1 /tmp/1 mount /dev/sda2 /tmp/1 mount /dev/sdb1 /tmp/1 Teraz przy pomocy ftp (np. total commanderem) kopiujemy 1 image do katalogu /tmp/1 Kolejne do /tmp/2 itp. Rozpakowanie image Wchodzimy telnetem do katalogu /tmp/1 cd /tmp/1 tar -xvzf
  14. heee ty mnie nie pouczaj ja się robi bo nie wiesz wszystkiego , to ja jako pierwszy image nbxa instalowałem na hdd , ja wszyscy męczyli się z nand
  15. nbox:/tmp/1# cd /autofs/sda5/etc/rc3.d/ nbox:/autofs/sda5/etc/rc3.d# ln -s ../init.d/evremote2.sh S22evremote2 nbox:/autofs/sda5/etc/rc3.d# cd nbox:~# to jest sda5
×
×
  • Create New...

Important Information

We have placed cookies on your device to help make this website better. You can adjust your cookie settings, otherwise we'll assume you're okay to continue.